Target
Dual 3',5'-cyclic-AMP and -GMP phosphodiesterase 11A
Ligand
BDBM253042
Substrate
Meas. Tech.
Inhibtion Assay
pH
7.5±n/a
Temperature
303.15±n/a K
IC50
>10000±n/a nM
Comments
extracted
Citation
 Cutshall, NSFerguson, KMZuta, CP Optically active PDE10 inhibitor US Patent  US9493447 Publication Date 11/15/2016 
Target
Name:
Dual 3',5'-cyclic-AMP and -GMP phosphodiesterase 11A
Synonyms:
Dual 3',5'-cyclic-AMP and -GMP phosphodiesterase 11A PDE11_HUMAN Phosphodiesterase 11A Phosphodiesterase 11A4 | cAMP and cGMP phosphodiesterase 11A
Type:
Enzyme
Mol. Mass.:
104751.53
Organism:
Homo sapiens (Human)
Description:
Q9HCR9
Residue:
933
  
Inhibitor
Name:
BDBM253042
Synonyms:
US9493447, 1001
Type:
Small organic molecule
Emp. Form.:
C25H23ClN2O5S
Mol. Mass.:
498.979
SMILES:
CCOC(C(=O)c1ccc(o1)-c1cc(OC)c(Cl)c(OC)c1)c1ccc(cc1)-c1nnc(C)s1
: