Target
cAMP and cAMP-inhibited cGMP 3',5'-cyclic phosphodiesterase 10A
Ligand
BDBM253043
Substrate
Meas. Tech.
Inhibtion Assay
pH
7.5±n/a
Temperature
303.15±n/a K
IC50
0.44±n/a nM
Comments
extracted
Citation
 Cutshall, NSFerguson, KMZuta, CP Optically active PDE10 inhibitor US Patent  US9493447 Publication Date 11/15/2016 
Target
Name:
cAMP and cAMP-inhibited cGMP 3',5'-cyclic phosphodiesterase 10A
Synonyms:
3',5'-cyclic phosphodiesterase PDE10_HUMAN Phosphodiesterase 10A
Type:
Protein
Mol. Mass.:
88412.52
Organism:
Homo sapiens (Human)
Description:
Q9Y233
Residue:
779
  
Inhibitor
Name:
BDBM253043
Synonyms:
US9493447, 2001
Type:
Small organic molecule
Emp. Form.:
C25H23ClN2O5S
Mol. Mass.:
498.979
SMILES:
CCO[C@H](C(=O)c1ccc(o1)-c1cc(OC)c(Cl)c(OC)c1)c1ccc(cc1)-c1nnc(C)s1
: