Target
Prothrombin
Ligand
BDBM162629
Substrate
Meas. Tech.
Thrombin Activity Assay
pH
7.4±n/a
Temperature
298.15±n/a K
IC50
<100±n/a nM
Comments
extracted
Citation
 Short, KMPham, SMWilliams, DCKita, DB Multisubstituted aromatic compounds as serine protease inhibitors US Patent  US9687479 Publication Date 6/27/2017 
Target
Name:
Prothrombin
Synonyms:
Activation peptide fragment 1 Coagulation factor II Prothrombin precursor Thrombin heavy chain | Thrombin light chain
Type:
Protein
Mol. Mass.:
70029.57
Organism:
Homo sapiens (Human)
Description:
P00734
Residue:
622
  
Inhibitor
Name:
BDBM162629
Synonyms:
US9687479, 109 3-(5-[(5-chlorothiophen-2-yl)methyl]amino-1-[(2,3-dihydro-1,4-benzodioxin-5-yl)carbonyl]-1H-pyrazol-3-yl)-1-(2-methoxyethyl)-1,2-dihydropyridin-2-one
Type:
Small Organic Molecule
Emp. Form.:
C25H23ClN4O5S
Mol. Mass.:
526.992
SMILES:
COCCn1cccc(-c2cc(NCc3ccc(Cl)s3)n(n2)C(=O)c2cccc3OCCOc23)c1=O
: