Target
Leucine-rich repeat serine/threonine-protein kinase 2
Ligand
BDBM254939
Substrate
Meas. Tech.
Homogeneous Time Resolved-fluorescence Resonance Energy Transfer (TR-FRET) Assay
pH
8.5±n/a
Temperature
303.15±n/a K
IC50
27±n/a nM
Comments
extracted
Citation
 Bedford, STChen, IWang, YWilliamson, DS Arylpyrrolopyridine derived compounds as LRRK2 inhibitors US Patent  US9499542 Publication Date 11/22/2016 
Target
Name:
Leucine-rich repeat serine/threonine-protein kinase 2
Synonyms:
Dardarin LRRK2_HUMAN Leucine-rich repeat serine/threonine-protein kinase 2 PARK8
Type:
Protein
Mol. Mass.:
286113.20
Organism:
Homo sapiens (Human)
Description:
Q5S007
Residue:
2527
  
Inhibitor
Name:
BDBM254939
Synonyms:
US9499542, 22 | US9675594, 22
Type:
Small organic molecule
Emp. Form.:
C18H15N7
Mol. Mass.:
329.3586
SMILES:
Cc1cncc(c1)-c1cc(Nc2ccn(C)n2)nc2[nH]cc(C#N)c12
: