Target
chymase
Ligand
BDBM256028
Substrate
Meas. Tech.
Enzymatic Chymase Assay
pH
7.5±n/a
IC50
3±n/a nM
Comments
extracted
Citation
 Fürstner, CAckerstaff, JStraub, AMeier, HTinel, HZimmermann, KTersteegen, AZubov, DKast, RSchamberger, JSchäfer, MBörngen, K Bicyclically substituted uracils and the use thereof US Patent  US9481672 Publication Date 11/1/2016 
Target
Name:
chymase
Synonyms:
Type:
Enzyme
Mol. Mass.:
27507.42
Organism:
Mesocricetus auratus (Golden hamster)
Description:
A0A1U7QTH6
Residue:
247
  
Inhibitor
Name:
BDBM256028
Synonyms:
US9481672, 206
Type:
Small organic molecule
Emp. Form.:
C24H19ClF3N3O5
Mol. Mass.:
521.873
SMILES:
CN1C(=O)C(C)(C)c2ccc(cc12)-n1cc(C(O)=O)c(=O)n(Cc2cccc(c2Cl)C(F)(F)F)c1=O
: