Target
Beta-secretase 1
Ligand
BDBM256785
Substrate
Meas. Tech.
HTRF FRET Assay
pH
5±n/a
Temperature
303.15±n/a K
Ki
1±n/a nM
Comments
extracted
Citation
 Cumming, JNKaelin, Jr., DEScott, JDStamford, AWIserloh, U C6-azaspiro iminothiadiazine dioxides as bace inhibitors, compositions, and their use US Patent  US9489013 Publication Date 11/8/2016 
Target
Name:
Beta-secretase 1
Synonyms:
ASP2 Aspartyl protease 2 BACE1 Beta-secretase (BACE) Beta-secretase 1 (BACE 1) Beta-secretase 1 (BACE1) Beta-site amyloid precursor protein cleaving enzyme 1 Memapsin-2 beta-Secretase (BACE-1) | beta-Secretase (BACE1)
Type:
Protein
Mol. Mass.:
55755.10
Organism:
Homo sapiens (Human)
Description:
P56817
Residue:
501
  
Inhibitor
Name:
BDBM256785
Synonyms:
US9489013, 56
Type:
Small organic molecule
Emp. Form.:
C23H29FN6O6S2
Mol. Mass.:
568.641
SMILES:
CCS(=O)(=O)N1CC[C@@]2(C1)[C@](C)(NC(=N)N(C)S2(=O)=O)c1cc(NC(=O)c2ccc(OC)cn2)ccc1F
: