Target
Melanin-concentrating hormone receptor 1 [E4Q,A5T]
Ligand
BDBM258783
Substrate
Meas. Tech.
Radioligand Binding Assay
pH
7.4±n/a
Ki
0.6±n/a nM
Comments
extracted
Citation
 Washburn, WNMurugaiah Subbaiah, MAAhmad, S Pyrrolone or pyrrolidinone melanin concentrating hormone receptor-1 antagonists US Patent  US9499482 Publication Date 11/22/2016 
Target
Name:
Melanin-concentrating hormone receptor 1 [E4Q,A5T]
Synonyms:
GPR24 MCHR1_HUMAN SLC1
Type:
Enzyme
Mol. Mass.:
46077.38
Organism:
Homo sapiens (Human)
Description:
Q99705 (E4Q, A5T)
Residue:
422
  
Inhibitor
Name:
BDBM258783
Synonyms:
US9499482, 189
Type:
Small organic molecule
Emp. Form.:
C26H28F2N2O5
Mol. Mass.:
486.5077
SMILES:
COC1CN(CCOc2ccc(cc2OC(F)F)N2CC=C(Oc3ccc(cc3)C3CC3)C2=O)C1
: