Target
Tyrosine-protein phosphatase non-receptor type 6
Ligand
BDBM50054344
Substrate
Meas. Tech.
Inhibition Assay
IC50
1440±40 nM
Citation
 Zhang, ZZeng, L Hydroxyindole carboxylic acid based inhibitors for oncogenic Src homology-2 domain containing protein tyrosine phosphatase-2 (SHP2) US Patent  US9522881 Publication Date 12/20/2016 
Target
Name:
Tyrosine-protein phosphatase non-receptor type 6
Synonyms:
HCP PTP1C Protein tyrosine phosphatase SHP-1 (SHP-1) Protein-tyrosine phosphatase SHP-1 Tyrosine-protein phosphatase non-receptor type 6 | Tyrosine-protein phosphatase non-receptor type 6 (SHP1)
Type:
Protein
Mol. Mass.:
67570.41
Organism:
Homo sapiens (Human)
Description:
P29350
Residue:
595
  
Inhibitor
Name:
BDBM50054344
Synonyms:
CHEMBL3319356 US9844535, ID 11a-1 L97M74
Type:
Small organic molecule
Emp. Form.:
C28H20IN3O5S
Mol. Mass.:
637.445
SMILES:
Cn1c(c(I)c2cc(C(O)=O)c(O)cc12)-c1cccc(NC(=O)C(=O)Nc2ccc(cc2)-c2ccsc2)c1
: