Target
Tyrosine-protein kinase ABL1 [T315I]
Ligand
BDBM260157
Substrate
Meas. Tech.
Enzyme Assay
IC50
<20±n/a nM
Citation
 Chilov, GGTitov, IY Protein kinase inhibitors (variants), use thereof in treating oncological diseases and a pharmaceutical composition based thereon US Patent  US9522910 Publication Date 12/20/2016 
Target
Name:
Tyrosine-protein kinase ABL1 [T315I]
Synonyms:
ABL ABL1 Abelson murine leukemia viral oncogene homolog 1 Proto-oncogene c-Abl Tyrosine-protein kinase ABL (T315I) c-ABL p150
Type:
Mol. Mass.:
122909.35
Organism:
Homo sapiens (Human)
Description:
P00519 (T315I)
Residue:
1130
  
Inhibitor
Name:
BDBM260157
Synonyms:
US9522910, Table 1 Compound 8: 4-fluoro-N-{4-[(4-methylpiperazin-1-yl)methyl]-3-(trifluoromethyl)phenyl}-3-(2-{[1,2,4]triazolo[4,3-a]pyridin-3-yl}ethynyl)benzamide
Type:
Small organic molecule
Emp. Form.:
C28H24F4N6O
Mol. Mass.:
536.5234
SMILES:
CN1CCN(Cc2ccc(NC(=O)c3ccc(F)c(c3)C#Cc3nnc4ccccn34)cc2C(F)(F)F)CC1
: