Target
Bifunctional epoxide hydrolase 2
Ligand
BDBM408992
Substrate
Meas. Tech.
FRET-displacement assay
Ki
0.510±0.03 nM
Citation
 Hammock, BDLee, KSInceoglu, AB Potent soluble epdxide hydrolase inhibitors US Patent  US10377744 Publication Date 8/13/2019 
Target
Name:
Bifunctional epoxide hydrolase 2
Synonyms:
Cytosolic epoxide hydrolase 2 EPHX2 HYES_HUMAN Soluble epoxide hydrolase (sEH) | epoxide hydrolase 2, cytoplasmic
Type:
Enzyme
Mol. Mass.:
62613.07
Organism:
Homo sapiens (Human)
Description:
P34913
Residue:
555
  
Inhibitor
Name:
BDBM408992
Synonyms:
US10377744, Compound No. 13 US11123311, Compound 14 | US11723929, Compound 14
Type:
Small organic molecule
Emp. Form.:
C19H20F3N3O3
Mol. Mass.:
395.3756
SMILES:
Cc1occc1C(=O)N1CCC(CC1)NC(=O)Nc1ccc(cc1)C(F)(F)F
: