Target
Bifunctional epoxide hydrolase 2
Ligand
BDBM408999
Substrate
Meas. Tech.
FRET-displacement assay
Ki
0.490±0.4 nM
Citation
 Hammock, BDLee, KSInceoglu, AB Potent soluble epdxide hydrolase inhibitors US Patent  US10377744 Publication Date 8/13/2019 
Target
Name:
Bifunctional epoxide hydrolase 2
Synonyms:
Cytosolic epoxide hydrolase 2 EPHX2 HYES_HUMAN Soluble epoxide hydrolase (sEH) | epoxide hydrolase 2, cytoplasmic
Type:
Enzyme
Mol. Mass.:
62613.07
Organism:
Homo sapiens (Human)
Description:
P34913
Residue:
555
  
Inhibitor
Name:
BDBM408999
Synonyms:
US10377744, Compound No. 20 US11723929, Compound 20
Type:
Small organic molecule
Emp. Form.:
C17H21F4N3O2
Mol. Mass.:
375.3612
SMILES:
CC(C)C(=O)N1CCC(CC1)NC(=O)Nc1ccc(c(F)c1)C(F)(F)F
: