Target
Tyrosine-protein kinase JAK3
Ligand
BDBM228713
Substrate
Meas. Tech.
Enzymatic Assay
IC50
550±n/a nM
Citation
 Su, WDeng, WLi, JJi, J Pyrrolopyrimidine compounds and uses thereof US Patent  US10369153 Publication Date 8/6/2019 
Target
Name:
Tyrosine-protein kinase JAK3
Synonyms:
JAK-3 JAK3_HUMAN Janus kinase 3 (JAK3) L-JAK | Leukocyte janus kinase
Type:
Protein
Mol. Mass.:
125111.08
Organism:
Homo sapiens (Human)
Description:
P52333
Residue:
1124
  
Inhibitor
Name:
BDBM228713
Synonyms:
US10369153, Compound 60 | US9346810, 60
Type:
Small Organic Molecule
Emp. Form.:
C16H16N8
Mol. Mass.:
320.3518
SMILES:
CN([C@@H]1CCN(C1)c1ncnc2[nH]ccc12)c1ccc(nn1)C#N
: