Target
Proto-oncogene tyrosine-protein kinase receptor Ret [G810R]
Ligand
BDBM305163
Substrate
Meas. Tech.
HTRF Kinease-TK Assay
IC50
139±n/a nM
Citation
 Andrews, SWAronow, SBlake, JFBrandhuber, BJCollier, JCook, AHaas, JJiang, YKolakowski, GRMcFaddin, EAMcKenney, MLMcNulty, OTMetcalf, ATMoreno, DARamann, GATang, TPRen, LWalls, SM Substituted pyrazolo[1,5-A]pyridine compounds as RET kinase inhibitors US Patent  US10441581 Publication Date 10/15/2019 
Target
Name:
Proto-oncogene tyrosine-protein kinase receptor Ret [G810R]
Synonyms:
CDHF12 PTC RET RET kinase mutant (G810R) RET_HUMAN | ret enzyme (g810r)
Type:
Enzyme Catalytic Domain
Mol. Mass.:
124418.43
Organism:
Homo sapiens (Human)
Description:
P07949[G810R]
Residue:
1114
  
Inhibitor
Name:
BDBM305163
Synonyms:
US10144734, Example 179 US10441581, Example 179 US11648243, Example 179
Type:
Small organic molecule
Emp. Form.:
C25H25N7O4
Mol. Mass.:
487.5105
SMILES:
COc1ccc(OC2CN(C2)c2ccc(cn2)-c2cc(OCC(C)(C)O)cn3ncc(C#N)c23)nn1
: