Target
Proto-oncogene tyrosine-protein kinase receptor Ret [G810R]
Ligand
BDBM305432
Substrate
Meas. Tech.
HTRF Kinease-TK Assay
IC50
1111±n/a nM
Citation
 Andrews, SWAronow, SBlake, JFBrandhuber, BJCollier, JCook, AHaas, JJiang, YKolakowski, GRMcFaddin, EAMcKenney, MLMcNulty, OTMetcalf, ATMoreno, DARamann, GATang, TPRen, LWalls, SM Substituted pyrazolo[1,5-A]pyridine compounds as RET kinase inhibitors US Patent  US10441581 Publication Date 10/15/2019 
Target
Name:
Proto-oncogene tyrosine-protein kinase receptor Ret [G810R]
Synonyms:
CDHF12 PTC RET RET kinase mutant (G810R) RET_HUMAN | ret enzyme (g810r)
Type:
Enzyme Catalytic Domain
Mol. Mass.:
124418.43
Organism:
Homo sapiens (Human)
Description:
P07949[G810R]
Residue:
1114
  
Inhibitor
Name:
BDBM305432
Synonyms:
US10144734, Example 449 US10441581, Example 449 US11648243, Example 449
Type:
Small organic molecule
Emp. Form.:
C29H31FN6O
Mol. Mass.:
498.5944
SMILES:
CCOc1cc(-c2ccc(nc2)N2CCC(C)(CC2)NCc2cc(F)ccc2C)c2c(cnn2c1)C#N
: