Target
Replicase polyprotein 1ab
Ligand
BDBM419123
Substrate
Meas. Tech.
FRET enzyme assay
IC50
650±60 nM
Citation
 Rathnayake, ADZheng, JKim, YPerera, KDMackin, SMeyerholz, DKKashipathy, MMBattaile, KPLovell, SPerlman, SGroutas, WCChang, KO 3C-like protease inhibitors block coronavirus replication in vitro and improve survival in MERS-CoV-infected mice. Sci Transl Med 12:0 (2020)  
Target
Name:
Replicase polyprotein 1ab
Synonyms:
ORF1ab polyprotein pp1ab | rep
Type:
Protein
Mol. Mass.:
794070.71
Organism:
2019-nCoV
Description:
P0DTD1
Residue:
7096
  
Inhibitor
Name:
BDBM419123
Synonyms:
3CLpro inhibitor 7a
Type:
Small organic molecule
Emp. Form.:
C20H33N3O5
Mol. Mass.:
395.4931
SMILES:
CC(C)C[C@@H](NC(=O)OC1CCCCC1)C(=O)N[C@H](CC1CCNC1=O)C=O
: