Target
Interleukin-17A
Ligand
BDBM419192
Substrate
Meas. Tech.
I L-17A Secretion
IC50
<100±n/a nM
Citation
 Musicki, BBouix-Peter, COuvry, GThoreau, E Benzenesulfonamide derivatives as inverse agonists of retinoid-related orphan receptor gamma (RORγ(T)) US Patent  US10457637 Publication Date 10/29/2019 
Target
Name:
Interleukin-17A
Synonyms:
CTLA8 IL-17 IL17A il-17a
Type:
Enzyme Catalytic Domain
Mol. Mass.:
17511.44
Organism:
Homo sapiens (Human)
Description:
Q16552
Residue:
155
  
Inhibitor
Name:
BDBM419192
Synonyms:
N-(4-ethylphenyl)-N- isobutyl-3-(S- methylsulfonimidoyl)-4- ((pyridin-4- ylmethyl)amino)benzene- sulfonamide | US10457637, Compound 64
Type:
Small organic molecule
Emp. Form.:
C25H32N4O3S2
Mol. Mass.:
500.677
SMILES:
CCc1ccc(cc1)N(CC(C)C)S(=O)(=O)c1ccc(NCc2ccncc2)c(c1)S(C)(=N)=O
: