Target
Nuclear receptor ROR-gamma
Ligand
BDBM419234
Substrate
Meas. Tech.
GAL4-RORgamma Transactivation
IC50
550±n/a nM
Citation
 Musicki, BBouix-Peter, COuvry, GThoreau, E Benzenesulfonamide derivatives as inverse agonists of retinoid-related orphan receptor gamma (RORγ(T)) US Patent  US10457637 Publication Date 10/29/2019 
Target
Name:
Nuclear receptor ROR-gamma
Synonyms:
NR1F3 Nuclear receptor ROR-gamma (RORC) RAR-related orphan receptor C (RORc) RORG RZRG Retinoid-related orphan receptor-gamma (RORc)
Type:
Enzyme Catalytic Domain
Mol. Mass.:
58218.40
Organism:
Homo sapiens (Human)
Description:
P51449
Residue:
518
  
Inhibitor
Name:
BDBM419234
Synonyms:
N-(4-ethylphenyl)-N- isobutyl-3-(S- methylsulfonimidoyl)-4-(2- oxa-6-azaspiro[3.4]octan-6- yl)benzenesulfonamide | US10457637, Compound 112
Type:
Small organic molecule
Emp. Form.:
C25H35N3O4S2
Mol. Mass.:
505.693
SMILES:
CCc1ccc(cc1)N(CC(C)C)S(=O)(=O)c1ccc(N2CCC3(COC3)C2)c(c1)S(C)(=N)=O
: