Target
Vascular endothelial growth factor receptor 2
Ligand
BDBM24498
Substrate
Meas. Tech.
In-Vitro Kinase Inhibition Assay
Ki
3.00±n/a nM
Citation
 Horn, G Multi-tyrosine kinase inhibitors derivatives and methods of use US Patent  US10464902 Publication Date 11/5/2019 
Target
Name:
Vascular endothelial growth factor receptor 2
Synonyms:
CD_antigen=CD309 Fetal liver kinase 1 (FLK-1) KDR Protein-tyrosine kinase receptor Flk-1 VEGFR-2 VEGFR2 Vascular Endothelial Growth Factor Receptor Kinase 2 Vascular endothelial growth factor receptor 2 (KDR) Vascular endothelial growth factor receptor 2 (VEGFR2) Vascular endothelial growth factor receptor-2 (VEGFR-2)
Type:
Receptor Tyrosine Kinase
Mol. Mass.:
151510.97
Organism:
Homo sapiens (Human)
Description:
P35968
Residue:
1356
  
Inhibitor
Name:
BDBM24498
Synonyms:
3-(3-fluoro-4-{[2-(1-methyl-1H-imidazol-4-yl)thieno[3,2-b]pyridin-7-yl]oxy}phenyl)-1-(2-phenylacetyl)thiourea US10464902, MGCD-265 | thieno[3,2-b]pyridine-based inhibitor, 10a
Type:
Small organic molecule
Emp. Form.:
C26H20FN5O2S2
Mol. Mass.:
517.598
SMILES:
Cn1cnc(c1)-c1cc2nccc(Oc3ccc(NC(=S)NC(=O)Cc4ccccc4)cc3F)c2s1
: