Target
Replicase polyprotein 1ab
Ligand
BDBM420297
Substrate
Meas. Tech.
enzymatic assay
IC50
40±2 nM
Citation
 Dai, WZhang, BJiang, XMSu, HLi, JZhao, YXie, XJin, ZPeng, JLiu, FLi, CLi, YBai, FWang, HCheng, XCen, XHu, SYang, XWang, JLiu, XXiao, GJiang, HRao, ZZhang, LKXu, YYang, HLiu, H Structure-based design of antiviral drug candidates targeting the SARS-CoV-2 main protease. Science 368:1331-1335 (2020)  
Target
Name:
Replicase polyprotein 1ab
Synonyms:
ORF1ab polyprotein pp1ab | rep
Type:
Protein
Mol. Mass.:
794070.71
Organism:
2019-nCoV
Description:
P0DTD1
Residue:
7096
  
Inhibitor
Name:
BDBM420297
Synonyms:
acs.jmedchem.1c00409_ST.30 peptidomimetic aldehydes 11b | peptidomimetic coronavirus 3CLpro inhibitors 11b
Type:
Small organic molecule
Emp. Form.:
C25H25FN4O4
Mol. Mass.:
464.4888
SMILES:
Fc1cccc(C[C@H](NC(=O)c2cc3ccccc3[nH]2)C(=O)N[C@@H](C[C@@H]2CCNC2=O)C=O)c1
: