Target
Replicase polyprotein 1ab
Ligand
BDBM420300
Substrate
Meas. Tech.
Inhibition of SARS-CoV-2 PLpro by SARS-CoV PLpro Inhibitors
IC50
23500±1700 nM
Citation
 Freitas, BTDurie, IAMurray, JLongo, JEMiller, HCCrich, DHogan, RJTripp, RAPegan, SD Characterization and Noncovalent Inhibition of the Deubiquitinase and deISGylase Activity of SARS-CoV-2 Papain-Like Protease. ACS Infect Dis 6:2099-2109 (2020)  
Target
Name:
Replicase polyprotein 1ab
Synonyms:
ORF1ab polyprotein pp1ab | rep
Type:
Protein
Mol. Mass.:
794070.71
Organism:
2019-nCoV
Description:
P0DTD1
Residue:
7096
  
Inhibitor
Name:
BDBM420300
Synonyms:
7724772 | med.21724, Compound 157
Type:
Emp. Form.:
C20H19NO
Mol. Mass.:
289.371
SMILES:
CC(NC(=O)c1ccccc1C)c1ccc2ccccc2c1
: