Target
Replicase polyprotein 1ab
Ligand
BDBM50438912
Substrate
Meas. Tech.
3CLpro enzyme assay
IC50
260±n/a nM
Citation
 Zhu, WXu, MChen, CZGuo, HShen, MHu, XShinn, PKlumpp-Thomas, CMichael, SGZheng, W Identification of SARS-CoV-2 3CL Protease Inhibitors by a Quantitative High-throughput Screening. bioRxiv 0:0 (2020)  
Target
Name:
Replicase polyprotein 1ab
Synonyms:
ORF1ab polyprotein pp1ab | rep
Type:
Protein
Mol. Mass.:
794070.71
Organism:
2019-nCoV
Description:
P0DTD1
Residue:
7096
  
Inhibitor
Name:
BDBM50438912
Synonyms:
CHEMBL1096283 MAT-POS-1e0c1c67-1 Walrycin B
Type:
Small organic molecule
Emp. Form.:
C14H10F3N5O2
Mol. Mass.:
337.2567
SMILES:
Cn1nc(nc2c1nc(=O)n(C)c2=O)-c1ccc(cc1)C(F)(F)F
: