Target
Replicase polyprotein 1ab
Ligand
BDBM420313
Substrate
Meas. Tech.
3CLpro enzyme assay
IC50
18020±n/a nM
Citation
 Zhu, WXu, MChen, CZGuo, HShen, MHu, XShinn, PKlumpp-Thomas, CMichael, SGZheng, W Identification of SARS-CoV-2 3CL Protease Inhibitors by a Quantitative High-throughput Screening. bioRxiv 0:0 (2020)  
Target
Name:
Replicase polyprotein 1ab
Synonyms:
ORF1ab polyprotein pp1ab | rep
Type:
Protein
Mol. Mass.:
794070.71
Organism:
2019-nCoV
Description:
P0DTD1
Residue:
7096
  
Inhibitor
Name:
BDBM420313
Synonyms:
Vitamin B12
Type:
Small Organic Molecule
Emp. Form.:
C62H88N13O14P
Mol. Mass.:
1270.4157
SMILES:
CC(CNC(=O)CCC1(C)C(CC(N)=O)C2N=C1C(C)=C1N=C(C=C3N=C(C(C)=C4[N-]C2(C)C(C)(CC(N)=O)C4CCC(N)=O)C(C)(CC(N)=O)C3CCC(N)=O)C(C)(C)C1CCC(N)=O)OP([O-])(=O)OC1C(CO)OC(C1O)n1cnc2cc(C)c(C)cc12
: