Target
Replicase polyprotein 1ab
Ligand
BDBM50289149
Substrate
Meas. Tech.
3CLpro enzyme assay
IC50
21520±n/a nM
Citation
 Zhu, WXu, MChen, CZGuo, HShen, MHu, XShinn, PKlumpp-Thomas, CMichael, SGZheng, W Identification of SARS-CoV-2 3CL Protease Inhibitors by a Quantitative High-throughput Screening. bioRxiv 0:0 (2020)  
Target
Name:
Replicase polyprotein 1ab
Synonyms:
ORF1ab polyprotein pp1ab | rep
Type:
Protein
Mol. Mass.:
794070.71
Organism:
2019-nCoV
Description:
P0DTD1
Residue:
7096
  
Inhibitor
Name:
BDBM50289149
Synonyms:
GW305074X US10570155, GW5074 | US11332479, Compound GW5074
Type:
Small organic molecule
Emp. Form.:
C15H8Br2INO2
Mol. Mass.:
520.942
SMILES:
Oc1c(Br)cc(C=C2C(=O)Nc3ccc(I)cc23)cc1Br
: