Target
Replicase polyprotein 1ab
Ligand
BDBM31712
Substrate
Meas. Tech.
SARS-CoV-2 CPE assay
EC50
790±n/a nM
Citation
 Zhu, WXu, MChen, CZGuo, HShen, MHu, XShinn, PKlumpp-Thomas, CMichael, SGZheng, W Identification of SARS-CoV-2 3CL Protease Inhibitors by a Quantitative High-throughput Screening. bioRxiv 0:0 (2020)  
Target
Name:
Replicase polyprotein 1ab
Synonyms:
ORF1ab polyprotein pp1ab | rep
Type:
Protein
Mol. Mass.:
794070.71
Organism:
2019-nCoV
Description:
P0DTD1
Residue:
7096
  
Inhibitor
Name:
BDBM31712
Synonyms:
HEXACHLOROPHENE MLS000028433 cid_3598
Type:
Small organic molecule
Emp. Form.:
C13H6Cl6O2
Mol. Mass.:
406.904
SMILES:
Oc1c(Cl)cc(Cl)c(Cl)c1Cc1c(O)c(Cl)cc(Cl)c1Cl
: