Target
Replicase polyprotein 1ab
Ligand
BDBM420352
Substrate
Meas. Tech.
IC50 Determination
IC50
1100±100 nM
Citation
 St. John, SEMesecar, AD Broad-spectrum non-covalent coronavirus protease inhibitors US Patent  US9975885 Publication Date 5/22/2018 
Target
Name:
Replicase polyprotein 1ab
Synonyms:
ORF1ab polyprotein pp1ab | rep
Type:
Protein
Mol. Mass.:
795222.79
Organism:
BtCoV
Description:
P0C6W3
Residue:
7119
  
Inhibitor
Name:
BDBM420352
Synonyms:
US9975885, Compound 13
Type:
Small organic molecule
Emp. Form.:
C34H34N6O4
Mol. Mass.:
590.6716
SMILES:
COc1ccc(cc1)C(N(C(=O)Cn1nnc2ccccc12)c1ccc(NC(=O)C(C)C)cc1)C(=O)NCc1ccccc1
: