Target
Replicase polyprotein 1ab
Ligand
BDBM420954
Substrate
Meas. Tech.
IC50 Determination
IC50
9600±1200 nM
Citation
 St. John, SEMesecar, AD Broad-spectrum non-covalent coronavirus protease inhibitors US Patent  US9975885 Publication Date 5/22/2018 
Target
Name:
Replicase polyprotein 1ab
Synonyms:
ORF1ab polyprotein pp1ab | rep
Type:
Protein
Mol. Mass.:
799837.52
Organism:
BtCoV
Description:
P0C6W4
Residue:
7181
  
Inhibitor
Name:
BDBM420954
Synonyms:
US9975885, Compound 15
Type:
Small organic molecule
Emp. Form.:
C32H31N7O3
Mol. Mass.:
561.6336
SMILES:
CC(C)C(=O)Nc1ccc(cc1)N(C(C(=O)NCc1ccccc1)c1cccnc1)C(=O)Cn1nnc2ccccc12
: