Target
Replicase polyprotein 1ab
Ligand
BDBM420973
Substrate
Meas. Tech.
IC50 Determination
IC50
2400±300 nM
Citation
 St. John, SEMesecar, AD Broad-spectrum non-covalent coronavirus protease inhibitors US Patent  US9975885 Publication Date 5/22/2018 
Target
Name:
Replicase polyprotein 1ab
Synonyms:
ORF1ab polyprotein pp1ab | rep
Type:
Protein
Mol. Mass.:
799837.52
Organism:
BtCoV
Description:
P0C6W4
Residue:
7181
  
Inhibitor
Name:
BDBM420973
Synonyms:
US9975885, Compound 29
Type:
Small organic molecule
Emp. Form.:
C27H28N6O3S
Mol. Mass.:
516.615
SMILES:
CC(C)NC(=O)C(N(C(=O)Cn1nnc2ccccc12)c1ccc(NC(=O)C2CC2)cc1)c1ccsc1
: