Target
Replicase polyprotein 1ab
Ligand
BDBM420977
Substrate
Meas. Tech.
IC50 Determination
IC50
9800±1800 nM
Citation
 St. John, SEMesecar, AD Broad-spectrum non-covalent coronavirus protease inhibitors US Patent  US9975885 Publication Date 5/22/2018 
Target
Name:
Replicase polyprotein 1ab
Synonyms:
ORF1ab polyprotein pp1ab | rep
Type:
Protein
Mol. Mass.:
805759.07
Organism:
HCoV-HKU1
Description:
P0C6X4
Residue:
7132
  
Inhibitor
Name:
BDBM420977
Synonyms:
US9975885, Compound 32
Type:
Small organic molecule
Emp. Form.:
C27H26N6O3S
Mol. Mass.:
514.599
SMILES:
O=C(Cn1nnc2ccccc12)N(C(C(=O)NC1CC1)c1ccsc1)c1ccc(NC(=O)C2CC2)cc1
: