Target
Replicase polyprotein 1ab
Ligand
BDBM420979
Substrate
Meas. Tech.
IC50 Determination
IC50
27500±3800 nM
Citation
 St. John, SEMesecar, AD Broad-spectrum non-covalent coronavirus protease inhibitors US Patent  US9975885 Publication Date 5/22/2018 
Target
Name:
Replicase polyprotein 1ab
Synonyms:
3C-like proteinase 3CLp Exoribonuclease Helicase NendoU Non-structural protein 10 Non-structural protein 2 Non-structural protein 4 Non-structural protein 7 Non-structural protein 9 PLP1/PLP2 Peptide HD2 Putative 2'-O-methyl transferase RNA-directed RNA polymerase Uridylate-specific endoribonuclease nsp10 nsp12 nsp14 nsp16 nsp3 nsp5 nsp7 nsp9 rep
Type:
PROTEIN
Mol. Mass.:
751194.38
Organism:
Feline coronavirus (strain FIPV WSU-79/1146) (FCoV)
Description:
ChEMBL_117869
Residue:
6709
  
Inhibitor
Name:
BDBM420979
Synonyms:
US9975885, Compound 34
Type:
Small organic molecule
Emp. Form.:
C30H27N7O3S
Mol. Mass.:
565.645
SMILES:
O=C(Cn1nnc2ccccc12)N(C(C(=O)NCc1cccnc1)c1ccsc1)c1ccc(NC(=O)C2CC2)cc1
: