Target
Replicase polyprotein 1ab
Ligand
BDBM420985
Substrate
Meas. Tech.
IC50 Determination
IC50
7700±700 nM
Citation
 St. John, SEMesecar, AD Broad-spectrum non-covalent coronavirus protease inhibitors US Patent  US9975885 Publication Date 5/22/2018 
Target
Name:
Replicase polyprotein 1ab
Synonyms:
ORF1ab polyprotein pp1ab | rep
Type:
Protein
Mol. Mass.:
795222.79
Organism:
BtCoV
Description:
P0C6W3
Residue:
7119
  
Inhibitor
Name:
BDBM420985
Synonyms:
US9975885, Compound 38
Type:
Small organic molecule
Emp. Form.:
C25H31N5O2
Mol. Mass.:
433.5459
SMILES:
CC(C)Cc1ccc(cc1)N(C(C(=O)NC(C)(C)C)c1cccnc1)C(=O)c1c[nH]cn1
: