Target
Replicase polyprotein 1ab
Ligand
BDBM420990
Substrate
Meas. Tech.
IC50 Determination
IC50
13500±800 nM
Citation
 St. John, SEMesecar, AD Broad-spectrum non-covalent coronavirus protease inhibitors US Patent  US9975885 Publication Date 5/22/2018 
Target
Name:
Replicase polyprotein 1ab
Synonyms:
ORF1ab polyprotein pp1ab | rep
Type:
Protein
Mol. Mass.:
752739.97
Organism:
HCoV-NL63
Description:
P0C6X5
Residue:
6729
  
Inhibitor
Name:
BDBM420990
Synonyms:
US9975885, Compound 43
Type:
Small organic molecule
Emp. Form.:
C25H31N5O2
Mol. Mass.:
433.5459
SMILES:
CC(C)CNC(=O)C(N(C(=O)c1c[nH]cn1)c1ccc(cc1)C(C)(C)C)c1cccnc1
: