Target
Replicase polyprotein 1ab
Ligand
BDBM420992
Substrate
Meas. Tech.
IC50 Determination
IC50
11200±1000 nM
Citation
 St. John, SEMesecar, AD Broad-spectrum non-covalent coronavirus protease inhibitors US Patent  US9975885 Publication Date 5/22/2018 
Target
Name:
Replicase polyprotein 1ab
Synonyms:
ORF1ab polyprotein pp1ab | rep
Type:
Protein
Mol. Mass.:
795222.79
Organism:
BtCoV
Description:
P0C6W3
Residue:
7119
  
Inhibitor
Name:
BDBM420992
Synonyms:
US9975885, Compound 46
Type:
Small organic molecule
Emp. Form.:
C24H27N5O2
Mol. Mass.:
417.5035
SMILES:
CC(C)(C)c1ccc(cc1)N(C(C(=O)NC1CC1)c1cccnc1)C(=O)c1c[nH]cn1
: