Target
Replicase polyprotein 1ab
Ligand
BDBM420993
Substrate
Meas. Tech.
IC50 Determination
IC50
3400±400 nM
Citation
 St. John, SEMesecar, AD Broad-spectrum non-covalent coronavirus protease inhibitors US Patent  US9975885 Publication Date 5/22/2018 
Target
Name:
Replicase polyprotein 1ab
Synonyms:
ORF1ab polyprotein pp1ab | rep
Type:
Protein
Mol. Mass.:
805759.07
Organism:
HCoV-HKU1
Description:
P0C6X4
Residue:
7132
  
Inhibitor
Name:
BDBM420993
Synonyms:
US9975885, Compound 47
Type:
Small organic molecule
Emp. Form.:
C26H31N5O2
Mol. Mass.:
445.5566
SMILES:
CC(C)(C)c1ccc(cc1)N(C(C(=O)NC1CCCC1)c1cccnc1)C(=O)c1c[nH]cn1
: