Target
Replicase polyprotein 1ab
Ligand
BDBM420996
Substrate
Meas. Tech.
IC50 Determination
IC50
7000±300 nM
Citation
 St. John, SEMesecar, AD Broad-spectrum non-covalent coronavirus protease inhibitors US Patent  US9975885 Publication Date 5/22/2018 
Target
Name:
Replicase polyprotein 1ab
Synonyms:
ORF1ab polyprotein pp1ab | rep
Type:
Protein
Mol. Mass.:
797943.10
Organism:
HCoV-OC43
Description:
P0C6X6
Residue:
7095
  
Inhibitor
Name:
BDBM420996
Synonyms:
US9975885, Compound 77
Type:
Small organic molecule
Emp. Form.:
C27H33N5O2
Mol. Mass.:
459.5832
SMILES:
CC(C)(C)c1ccc(cc1)N(C(C(=O)NC1CCCCC1)c1cccnc1)C(=O)c1c[nH]cn1
: