Target
Trace amine-associated receptor 1
Ligand
BDBM250096
Substrate
Meas. Tech.
Radioligand Binding Assay
Ki
3.20±n/a nM
Citation
 Groebke Zbinden, KNorcross, RPflieger, P Substituted benzamides US Patent  US10501411 Publication Date 12/10/2019 
Target
Name:
Trace amine-associated receptor 1
Synonyms:
TAAR1_MOUSE Taar1 Trace amine receptor 1 (TARR1) Trace amine-associated receptor1 | Trar1
Type:
Protein
Mol. Mass.:
37635.41
Organism:
Mus musculus (Mouse)
Description:
Q923Y8
Residue:
332
  
Inhibitor
Name:
BDBM250096
Synonyms:
US10501411, Example 6 US9452980, 6
Type:
Small organic molecule
Emp. Form.:
C17H19N3O
Mol. Mass.:
281.3523
SMILES:
O=C(Nc1ccccc1)Nc1ccc(cc1)C1CCNC1
: