Target
Cyclin-dependent kinase/G2/mitotic-specific cyclin- 1
Ligand
BDBM6868
Substrate
Biotinylated CDK1 Peptide Substrate
Meas. Tech.
Kinase Inhibition Assay
pH
8±n/a
Temperature
303.15±n/a K
IC50
3.2±n/a nM
Citation
 Lin, RConnolly, PJHuang, SWetter, SKLu, YMurray, WVEmanuel, SLGruninger, RHFuentes-Pesquera, ARRugg, CAMiddleton, SAJolliffe, LK 1-Acyl-1H-[1,2,4]triazole-3,5-diamine analogues as novel and potent anticancer cyclin-dependent kinase inhibitors: synthesis and evaluation of biological activities. J Med Chem 48:4208-11 (2005)  
Target
Name:
Cyclin-dependent kinase/G2/mitotic-specific cyclin- 1
Synonyms:
CDK1/B CDK1/CyclinB Cyclin-Dependent Kinase 1 (CDK1) Cyclin-dependent kinase/G2/mitotic-specific cyclin 1 | cdk1
Type:
Protein Complex
Mol. Mass.:
Description:
CDK1/Cyclin B complexes were purified from insect cells co-infected with baculovirus vectors containing each of the components.
Components:
This complex has 2 components.
Component 1
Name:
Cyclin-dependent kinase 1
Synonyms:
CDC2 CDK1 CDKN1 Cell division protein kinase 1 P34CDC2 | p34 protein kinase
Type:
Enzyme Subunit
Mol. Mass.:
34101.08
Organism:
Homo sapiens (Human)
Description:
P06493
Residue:
297
  
Component 2
Name:
G2/mitotic-specific cyclin-B1
Synonyms:
CCNB CCNB1_HUMAN
Type:
Enzyme Subunit
Mol. Mass.:
48340.95
Organism:
Homo sapiens (Human)
Description:
P14635
Residue:
433
  
Inhibitor
Name:
BDBM6868
Synonyms:
1-Acyl-1H-[1,2,4]triazole-3,5-diamine Analogue 3d 4-[[5-Amino-1-(2,3,6-trifluorobenzoyl)-1H-1,2,4-triazol-3-yl]amino]-benzenesulfonamide
Type:
Small organic molecule
Emp. Form.:
C15H11F3N6O3S
Mol. Mass.:
412.346
SMILES:
Nc1nc(Nc2ccc(cc2)S(N)(=O)=O)nn1C(=O)c1c(F)ccc(F)c1F
:
Substrate
Name:
Biotinylated CDK1 Peptide Substrate
Synonyms:
Type:
Peptide
Mol. Mass.:
3057.82
Organism:
Description:
Residue:
27