Target
Calcium/calmodulin-dependent protein kinase type II subunit alpha
Ligand
BDBM6867
Substrate
CaM Kinase II Peptide Substrate
Meas. Tech.
Kinase Inhibition Assay
IC50
>100000±n/a nM
Citation
 Lin, RConnolly, PJHuang, SWetter, SKLu, YMurray, WVEmanuel, SLGruninger, RHFuentes-Pesquera, ARRugg, CAMiddleton, SAJolliffe, LK 1-Acyl-1H-[1,2,4]triazole-3,5-diamine analogues as novel and potent anticancer cyclin-dependent kinase inhibitors: synthesis and evaluation of biological activities. J Med Chem 48:4208-11 (2005)  
Target
Name:
Calcium/calmodulin-dependent protein kinase type II subunit alpha
Synonyms:
CaM Kinase II Camk2a calcium/calmodulin-dependent protein kinase II alpha subunit
Type:
Enzyme Mixture
Mol. Mass.:
54120.65
Organism:
Rattus norvegicus (rat)
Description:
Consists of subunits of M.W. 50,000 and 58,000-60,000 in a 3:1 ratio.
Residue:
478
  
Inhibitor
Name:
BDBM6867
Synonyms:
1-Acyl-1H-[1,2,4]triazole-3,5-diamine Analogue 3c 4-[[5-Amino-1-(2,6-difluoro-3-methylbenzoyl)-1H-1,2,4-triazol-3-yl]amino]-benzenesulfonamide
Type:
Small organic molecule
Emp. Form.:
C16H14F2N6O3S
Mol. Mass.:
408.383
SMILES:
Cc1ccc(F)c(C(=O)n2nc(Nc3ccc(cc3)S(N)(=O)=O)nc2N)c1F
:
Substrate
Name:
CaM Kinase II Peptide Substrate
Synonyms:
CaM Kinase II Peptide Substrate
Type:
Peptide
Mol. Mass.:
2528.92
Organism:
Description:
Residue:
22