Target
Toll-like receptor 7
Ligand
BDBM427905
Substrate
Meas. Tech.
TLR7/8/9 Inhibition Reporter Assays
IC50
0.200±n/a nM
Citation
 Dyckman, AJDodd, DSMussari, CPKumar, SR 4-azaindole compounds US Patent  US10544143 Publication Date 1/28/2020 
Target
Name:
Toll-like receptor 7
Synonyms:
ORF Names:UNQ248/PRO285 TLR7_HUMAN | Toll-like receptor 7 (TLR7)
Type:
Enzyme
Mol. Mass.:
120945.35
Organism:
Homo sapiens (Human)
Description:
Q9NYK1
Residue:
1049
  
Inhibitor
Name:
BDBM427905
Synonyms:
US10544143, Example 339 US10730877, Example 340 | US11053244, Example 340
Type:
Small organic molecule
Emp. Form.:
C28H35N7O
Mol. Mass.:
485.6238
SMILES:
COc1cc(cn2ncnc12)-c1[nH]c2cc(C)c(nc2c1C(C)C)C1CCC(CC1)N(C)CCC#N
: