Target
Toll-like receptor 8
Ligand
BDBM428633
Substrate
Meas. Tech.
TLR7/8/9 Inhibition Reporter Assays
IC50
0.170±n/a nM
Citation
 Dyckman, AJDodd, DSMussari, CPKumar, SR 4-azaindole compounds US Patent  US10544143 Publication Date 1/28/2020 
Target
Name:
Toll-like receptor 8
Synonyms:
CD_antigen: CD288 TLR8_HUMAN | TRL8
Type:
Enzyme
Mol. Mass.:
119828.77
Organism:
Homo sapiens (Human)
Description:
Q9NR97
Residue:
1041
  
Inhibitor
Name:
BDBM428633
Synonyms:
US10544143, Example 1069 US10730877, Example 1070 | US11053244, Example 1070
Type:
Small organic molecule
Emp. Form.:
C29H36N6O2
Mol. Mass.:
500.6351
SMILES:
COc1cc(cn2ncnc12)-c1[nH]c2ccc(nc2c1C(C)C)C1CCC(CC1)N1CC2(C1)CCOC2
: