Target
Replicase polyprotein 1ab
Ligand
BDBM429100
Substrate
Meas. Tech.
No assay is provided
Ki
68±n/a nM
Citation
 Pillaiyar, TManickam, MNamasivayam, VHayashi, YJung, SH An Overview of Severe Acute Respiratory Syndrome-Coronavirus (SARS-CoV) 3CL Protease Inhibitors: Peptidomimetics and Small Molecule Chemotherapy. J Med Chem 59:6595-628 (2016)  
Target
Name:
Replicase polyprotein 1ab
Synonyms:
ORF1ab polyprotein pp1ab | rep
Type:
Protein
Mol. Mass.:
754187.17
Organism:
HCoV-229E
Description:
P0C6X1
Residue:
6758
  
Inhibitor
Name:
BDBM429100
Synonyms:
MPI8 | jm5b01461, Compound 45
Type:
Small Organic Molecule
Emp. Form.:
C32H48N4O7
Mol. Mass.:
600.7461
SMILES:
CC(OC(C)(C)C)[C@H](NC(=O)OCc1ccccc1)C(=O)N[C@@H](CC1CCCCC1)C(=O)N[C@@H](C[C@@H]1CCNC1=O)C=O
: