Target
Replicase polyprotein 1ab
Ligand
BDBM47919
Substrate
Meas. Tech.
No assay is provided
IC50
2200±n/a nM
Citation
 Pillaiyar, TManickam, MNamasivayam, VHayashi, YJung, SH An Overview of Severe Acute Respiratory Syndrome-Coronavirus (SARS-CoV) 3CL Protease Inhibitors: Peptidomimetics and Small Molecule Chemotherapy. J Med Chem 59:6595-628 (2016)  
Target
Name:
Replicase polyprotein 1ab
Synonyms:
3C-like proteinase 3C-like proteinase (SARS-CoV 3Cpro) 3CLp GFL Guanine-N7 methyltransferase Helicase Leader protein Non-structural protein 10 Non-structural protein 3 Non-structural protein 6 Non-structural protein 8 ORF1ab polyprotein PL2-PRO Pol R1AB_SARS RdRp SARS coronavirus main proteinase nsp1 nsp12 nsp14 nsp16 nsp3 nsp5 nsp7 nsp9 pp1ab | rep
Type:
Protein
Mol. Mass.:
790250.81
Organism:
Human SARS coronavirus (SARS-CoV) (Severe acute respiratory syndrome coronavirus)
Description:
P0C6X7
Residue:
7073
  
Inhibitor
Name:
BDBM47919
Synonyms:
Furan-2-carboxylic acid (4-sec-butyl-phenyl)-(cyclopentylcarbamoyl-pyridin-3-yl-methyl)-amide N-(4-butan-2-ylphenyl)-N-[2-(cyclopentylamino)-2-oxidanylidene-1-pyridin-3-yl-ethyl]furan-2-carboxamide N-(4-butan-2-ylphenyl)-N-[2-(cyclopentylamino)-2-oxo-1-pyridin-3-ylethyl]furan-2-carboxamide SMR000600355 cid_3196508 | med.21724, Compound 122
Type:
Small organic molecule
Emp. Form.:
C27H31N3O3
Mol. Mass.:
445.5533
SMILES:
CCC(C)c1ccc(cc1)N(C(C(=O)NC1CCCC1)c1cccnc1)C(=O)c1ccco1
: