Target
Replicase polyprotein 1ab
Ligand
BDBM429360
Substrate
Meas. Tech.
No assay is provided
Ki
40±n/a nM
Citation
 Pillaiyar, TManickam, MNamasivayam, VHayashi, YJung, SH An Overview of Severe Acute Respiratory Syndrome-Coronavirus (SARS-CoV) 3CL Protease Inhibitors: Peptidomimetics and Small Molecule Chemotherapy. J Med Chem 59:6595-628 (2016)  
Target
Name:
Replicase polyprotein 1ab
Synonyms:
3C-like proteinase 3C-like proteinase (SARS-CoV 3Cpro) 3CLp GFL Guanine-N7 methyltransferase Helicase Leader protein Non-structural protein 10 Non-structural protein 3 Non-structural protein 6 Non-structural protein 8 ORF1ab polyprotein PL2-PRO Pol R1AB_SARS RdRp SARS coronavirus main proteinase nsp1 nsp12 nsp14 nsp16 nsp3 nsp5 nsp7 nsp9 pp1ab | rep
Type:
Protein
Mol. Mass.:
790250.81
Organism:
Human SARS coronavirus (SARS-CoV) (Severe acute respiratory syndrome coronavirus)
Description:
P0C6X7
Residue:
7073
  
Inhibitor
Name:
BDBM429360
Synonyms:
acs.jmedchem.1c00409_ST.31 jm5b01461, Compound 177
Type:
Small Organic Molecule
Emp. Form.:
C20H16B2N4O10
Mol. Mass.:
493.984
SMILES:
OB(O)c1cc(cc(c1)[N+]([O-])=O)C(=O)Nc1ccc(NC(=O)c2cc(cc(c2)[N+]([O-])=O)B(O)O)cc1
: