Target
Replicase polyprotein 1ab
Ligand
BDBM53105
Substrate
Meas. Tech.
No assay is provided
Ki
9930±n/a nM
Citation
 Pillaiyar, TManickam, MNamasivayam, VHayashi, YJung, SH An Overview of Severe Acute Respiratory Syndrome-Coronavirus (SARS-CoV) 3CL Protease Inhibitors: Peptidomimetics and Small Molecule Chemotherapy. J Med Chem 59:6595-628 (2016)  
Target
Name:
Replicase polyprotein 1ab
Synonyms:
3C-like proteinase 3C-like proteinase (SARS-CoV 3Cpro) 3CLp GFL Guanine-N7 methyltransferase Helicase Leader protein Non-structural protein 10 Non-structural protein 3 Non-structural protein 6 Non-structural protein 8 ORF1ab polyprotein PL2-PRO Pol R1AB_SARS RdRp SARS coronavirus main proteinase nsp1 nsp12 nsp14 nsp16 nsp3 nsp5 nsp7 nsp9 pp1ab | rep
Type:
Protein
Mol. Mass.:
790250.81
Organism:
Human SARS coronavirus (SARS-CoV) (Severe acute respiratory syndrome coronavirus)
Description:
P0C6X7
Residue:
7073
  
Inhibitor
Name:
BDBM53105
Synonyms:
CHEMBL1315054 N-[(Z)-1-[3-(dimethylamino)propylcarbamoyl]-2-[5-(2-nitrophenyl)-2-furyl]vinyl]-4-methyl-benzamide N-[(Z)-3-[3-(dimethylamino)propylamino]-1-[5-(2-nitrophenyl)furan-2-yl]-3-oxidanylidene-prop-1-en-2-yl]-4-methyl-benzamide N-{1-({[3-(dimethylamino)propyl]amino}carbonyl)-2-[5-(2-nitrophenyl)-2-furyl]vinyl}-4-methylbenzamide cid_2131982 | jm5b01461, Compound 187
Type:
Small organic molecule
Emp. Form.:
C26H28N4O5
Mol. Mass.:
476.5243
SMILES:
CN(C)CCCNC(=O)C(\NC(=O)c1ccc(C)cc1)=C\c1ccc(o1)-c1ccccc1[N+]([O-])=O
: