Target
Replicase polyprotein 1ab
Ligand
BDBM11261
Substrate
Meas. Tech.
No assay is provided
Ki
520±n/a nM
Citation
 Pillaiyar, TWendt, LLManickam, MEaswaran, M The recent outbreaks of human coronaviruses: A medicinal chemistry perspective. Med Res Rev 0:0 (2020)  
Target
Name:
Replicase polyprotein 1ab
Synonyms:
3C-like proteinase 3C-like proteinase (SARS-CoV 3Cpro) 3CLp GFL Guanine-N7 methyltransferase Helicase Leader protein Non-structural protein 10 Non-structural protein 3 Non-structural protein 6 Non-structural protein 8 ORF1ab polyprotein PL2-PRO Pol R1AB_SARS RdRp SARS coronavirus main proteinase nsp1 nsp12 nsp14 nsp16 nsp3 nsp5 nsp7 nsp9 pp1ab | rep
Type:
Protein
Mol. Mass.:
790250.81
Organism:
Human SARS coronavirus (SARS-CoV) (Severe acute respiratory syndrome coronavirus)
Description:
P0C6X7
Residue:
7073
  
Inhibitor
Name:
BDBM11261
Synonyms:
dipeptidomimetic unsaturated ester 18c ethyl (2E,4S)-4-[(N-{(2E)-3-[4-(dimethylamino)phenyl]prop-2-enoyl}-L-phenylalanyl)amino]-5-phenylpent-2-enoate | med.21724, Compound 39
Type:
Small organic molecule
Emp. Form.:
C33H37N3O4
Mol. Mass.:
539.6646
SMILES:
CCOC(=O)\C=C\[C@H](Cc1ccccc1)NC(=O)[C@H](Cc1ccccc1)NC(=O)\C=C\c1ccc(cc1)N(C)C
: