Target
Nuclear receptor subfamily 1 group I member 2
Ligand
BDBM429665
Substrate
Meas. Tech.
PXR Binding Assay
IC50
60.0±n/a nM
Citation
 Chen, TLin, WWang, Y 1,4,5-substituted 1,2,3-triazole analogues as antagonists of the pregnane X receptor US Patent  US10550091 Publication Date 2/4/2020 
Target
Name:
Nuclear receptor subfamily 1 group I member 2
Synonyms:
NR1I2 Orphan nuclear receptor PAR1 PXR SXR nuclear receptor subfamily 1 group I member 2 isoform 1
Type:
Nuclear receptor
Mol. Mass.:
49774.77
Organism:
Homo sapiens (Human)
Description:
O75469
Residue:
434
  
Inhibitor
Name:
BDBM429665
Synonyms:
US10550091, No. LC-74 | US10947203, No. LC-74
Type:
Small organic molecule
Emp. Form.:
C22H26N2O3S
Mol. Mass.:
398.518
SMILES:
COc1ccc(C)cc1-c1nc(C)c([nH]1)S(=O)(=O)c1ccc(cc1)C(C)(C)C
: