Target
Replicase polyprotein 1ab
Ligand
BDBM11242
Substrate
Meas. Tech.
DRC analysis by immunofluorescence
IC50
280±n/a nM
Citation
 Jeon, SKo, MLee, JChoi, IByun, SYPark, SShum, DKim, S Identification of Antiviral Drug Candidates against SARS-CoV-2 from FDA-Approved Drugs. Antimicrob Agents Chemother 64:0 (2020)  
Target
Name:
Replicase polyprotein 1ab
Synonyms:
ORF1ab polyprotein pp1ab | rep
Type:
Protein
Mol. Mass.:
794070.71
Organism:
2019-nCoV
Description:
P0DTD1
Residue:
7096
  
Inhibitor
Name:
BDBM11242
Synonyms:
5-chloro-N-(2-chloro-4-nitrophenyl)-2-hydroxybenzamide niclosamide
Type:
Small organic molecule
Emp. Form.:
C13H8Cl2N2O4
Mol. Mass.:
327.12
SMILES:
Oc1ccc(Cl)cc1C(=O)Nc1ccc(cc1Cl)[N+]([O-])=O
: