Target
Replicase polyprotein 1ab
Ligand
BDBM46355
Substrate
Meas. Tech.
DRC analysis by immunofluorescence
IC50
190±n/a nM
Citation
 Jeon, SKo, MLee, JChoi, IByun, SYPark, SShum, DKim, S Identification of Antiviral Drug Candidates against SARS-CoV-2 from FDA-Approved Drugs. Antimicrob Agents Chemother 64:0 (2020)  
Target
Name:
Replicase polyprotein 1ab
Synonyms:
ORF1ab polyprotein pp1ab | rep
Type:
Protein
Mol. Mass.:
794070.71
Organism:
2019-nCoV
Description:
P0DTD1
Residue:
7096
  
Inhibitor
Name:
BDBM46355
Synonyms:
DIGOXIN SMR000059217 cid_2724385
Type:
Small organic molecule
Emp. Form.:
C41H64O14
Mol. Mass.:
780.9385
SMILES:
C[C@H]1O[C@H](C[C@H](O)[C@@H]1O)O[C@H]1[C@@H](O)C[C@H](O[C@H]2[C@@H](O)C[C@H](O[C@H]3CC[C@@]4(C)[C@H](CC[C@@H]5[C@@H]4C[C@@H](O)[C@]4(C)[C@H](CC[C@]54O)C4=CC(=O)OC4)C3)O[C@@H]2C)O[C@@H]1C
: