Target
Replicase polyprotein 1ab
Ligand
BDBM50417554
Substrate
Meas. Tech.
DRC analysis by immunofluorescence
IC50
4640±n/a nM
Citation
 Jeon, SKo, MLee, JChoi, IByun, SYPark, SShum, DKim, S Identification of Antiviral Drug Candidates against SARS-CoV-2 from FDA-Approved Drugs. Antimicrob Agents Chemother 64:0 (2020)  
Target
Name:
Replicase polyprotein 1ab
Synonyms:
ORF1ab polyprotein pp1ab | rep
Type:
Protein
Mol. Mass.:
794070.71
Organism:
2019-nCoV
Description:
P0DTD1
Residue:
7096
  
Inhibitor
Name:
BDBM50417554
Synonyms:
ANIDULAFUNGIN
Type:
Small organic molecule
Emp. Form.:
C58H73N7O17
Mol. Mass.:
1140.2369
SMILES:
CCCCCOc1ccc(cc1)-c1ccc(cc1)-c1ccc(cc1)C(=O)N[C@H]1C[C@@H](O)[C@@H](O)NC(=O)[C@@H]2[C@@H](O)[C@@H](C)CN2C(=O)[C@@H](NC(=O)[C@@H](NC(=O)[C@@H]2C[C@@H](O)CN2C(=O)[C@@H](NC1=O)[C@@H](C)O)[C@H](O)[C@@H](O)c1ccc(O)cc1)[C@@H](C)O
: