Target
Replicase polyprotein 1ab
Ligand
BDBM430660
Substrate
Meas. Tech.
DRC analysis by immunofluorescence
IC50
3780±n/a nM
Citation
 Jeon, SKo, MLee, JChoi, IByun, SYPark, SShum, DKim, S Identification of Antiviral Drug Candidates against SARS-CoV-2 from FDA-Approved Drugs. Antimicrob Agents Chemother 64:0 (2020)  
Target
Name:
Replicase polyprotein 1ab
Synonyms:
ORF1ab polyprotein pp1ab | rep
Type:
Protein
Mol. Mass.:
794070.71
Organism:
2019-nCoV
Description:
P0DTD1
Residue:
7096
  
Inhibitor
Name:
BDBM430660
Synonyms:
Lusutrombopag
Type:
Small Organic Molecule
Emp. Form.:
C29H32Cl2N2O5S
Mol. Mass.:
591.546
SMILES:
CCCCCCO[C@@H](C)c1cccc(-c2csc(NC(=O)c3cc(Cl)c(\C=C(/C)C(O)=O)c(Cl)c3)n2)c1OC
: