Target
Replicase polyprotein 1ab
Ligand
BDBM50241654
Substrate
Meas. Tech.
DRC analysis by immunofluorescence
IC50
7870±n/a nM
Citation
 Jeon, SKo, MLee, JChoi, IByun, SYPark, SShum, DKim, S Identification of Antiviral Drug Candidates against SARS-CoV-2 from FDA-Approved Drugs. Antimicrob Agents Chemother 64:0 (2020)  
Target
Name:
Replicase polyprotein 1ab
Synonyms:
ORF1ab polyprotein pp1ab | rep
Type:
Protein
Mol. Mass.:
794070.71
Organism:
2019-nCoV
Description:
P0DTD1
Residue:
7096
  
Inhibitor
Name:
BDBM50241654
Synonyms:
(+)-berbamine CHEMBL504323
Type:
Small organic molecule
Emp. Form.:
C37H40N2O6
Mol. Mass.:
608.7233
SMILES:
COc1cc2CCN(C)[C@H]3Cc4ccc(Oc5cc(C[C@H]6N(C)CCc7cc(OC)c(OC)c(Oc1cc23)c67)ccc5O)cc4
: